jueves, diciembre 14, 2006

Compilar Beryl desde el SVN, bajandose el archivo trunk.zip

Esto esta en continuo desarrollo así que puede ser que algunos anden mal, pero se arregla siempre en alguno posterior, pruebenlo bajo su propia responsabilidad

Antes que nada se debe BORRAR POR COMPLETO la anterior instalacion de beryl (de existir)

Primero entramos a la pagina de los SVN

ACA

Entramos donde dice trunk y vamos hasta abajo de la pagina abierta ahi encontramos algo que dice

1 comentario:

Carlitros dijo...

Hola amigo, pues esta muy bien tu tuto, solo que me marca un error que no se a que se deba, de hecho marca una infinidad de errores en la parte de beryl-settings-bindings, lo que sale es lo siguiente, espero me puedas ayudar, tal vez no pueda poner todo pq en verdad que son bastantes, espero me puedas ayudar.

Gracias

berylsettings.c:6133: error: expected '=', ',', ';', 'asm' or '__attribute__' before '*' token
berylsettings.c:6142: error: expected ')' before '*' token
berylsettings.c:6156: error: expected ')' before '*' token
berylsettings.c:6162: error: expected ')' before '*' token
berylsettings.c:6167: error: expected '=', ',', ';', 'asm' or '__attribute__' before '*' token
berylsettings.c:6171: error: expected '=', ',', ';', 'asm' or '__attribute__' before '*' token
berylsettings.c:6175: error: expected '=', ',', ';', 'asm' or '__attribute__' before '*' token
berylsettings.c:6179: error: expected ')' before '*' token
berylsettings.c:6189: error: expected '=', ',', ';', 'asm' or '__attribute__' before '*' token
berylsettings.c:6193: error: expected '=', ',', ';', 'asm' or '__attribute__' before '*' token
berylsettings.c:6197: error: expected ')' before '*' token
berylsettings.c:6207: error: expected '=', ',', ';', 'asm' or '__attribute__' before '*' token
berylsettings.c:6211: error: array type has incomplete element type
berylsettings.c:6212: error: 'PyCFunction' undeclared here (not in a function)
berylsettings.c:6212: error: expected '}' before '__pyx_f_13berylsettings_7Context_EdgeOwner'
berylsettings.c:6213: error: expected '}' before '__pyx_f_13berylsettings_7Context_Conflicts'
berylsettings.c:6214: error: expected '}' before '__pyx_f_13berylsettings_7Context_Read'
berylsettings.c:6215: error: expected '}' before '__pyx_f_13berylsettings_7Context_Write'
berylsettings.c:6216: error: expected '}' before '__pyx_f_13berylsettings_7Context_Import'
berylsettings.c:6217: error: expected '}' before '__pyx_f_13berylsettings_7Context_Export'
berylsettings.c:6218: error: expected '}' before '__pyx_f_13berylsettings_7Context_Plugin'
berylsettings.c:6222: error: array type has incomplete element type
berylsettings.c:6223: error: '__pyx_getprop_13berylsettings_7Context_Categories' undeclared here (not in a function)
berylsettings.c:6224: error: '__pyx_getprop_13berylsettings_7Context_Plugins' undeclared here (not in a function)
berylsettings.c:6225: error: '__pyx_getprop_13berylsettings_7Context_Profile' undeclared here (not in a function)
berylsettings.c:6225: error: '__pyx_setprop_13berylsettings_7Context_Profile' undeclared here (not in a function)
berylsettings.c:6226: error: '__pyx_getprop_13berylsettings_7Context_Profiles' undeclared here (not in a function)
berylsettings.c:6227: error: '__pyx_getprop_13berylsettings_7Context_Integrated' undeclared here (not in a function)
berylsettings.c:6227: error: '__pyx_setprop_13berylsettings_7Context_Integrated' undeclared here (not in a function)
berylsettings.c:6228: error: '__pyx_getprop_13berylsettings_7Context_ActivePlugins' undeclared here (not in a function)
berylsettings.c:6232: error: expected '=', ',', ';', 'asm' or '__attribute__' before '__pyx_tp_as_number_Context'
berylsettings.c:6273: error: expected '=', ',', ';', 'asm' or '__attribute__' before '__pyx_tp_as_sequence_Context'
berylsettings.c:6286: error: expected '=', ',', ';', 'asm' or '__attribute__' before '__pyx_tp_as_mapping_Context'
berylsettings.c:6292: error: expected '=', ',', ';', 'asm' or '__attribute__' before '__pyx_tp_as_buffer_Context'
berylsettings.c:6299: error: expected '=', ',', ';', 'asm' or '__attribute__' before '__pyx_type_13berylsettings_Context'
berylsettings.c:6348: error: expected '=', ',', ';', 'asm' or '__attribute__' before '*' token
berylsettings.c:6358: error: expected ')' before '*' token
berylsettings.c:6364: error: expected ')' before '*' token
berylsettings.c:6373: error: expected ')' before '*' token
berylsettings.c:6380: error: expected '=', ',', ';', 'asm' or '__attribute__' before '*' token
berylsettings.c:6384: error: expected '=', ',', ';', 'asm' or '__attribute__' before '*' token
berylsettings.c:6388: error: expected '=', ',', ';', 'asm' or '__attribute__' before '*' token
berylsettings.c:6392: error: expected '=', ',', ';', 'asm' or '__attribute__' before '*' token
berylsettings.c:6396: error: array type has incomplete element type
berylsettings.c:6400: error: array type has incomplete element type
berylsettings.c:6401: error: '__pyx_getprop_13berylsettings_8Category_Name' undeclared here (not in a function)
berylsettings.c:6402: error: '__pyx_getprop_13berylsettings_8Category_ShortDesc' undeclared here (not in a function)
berylsettings.c:6403: error: '__pyx_getprop_13berylsettings_8Category_LongDesc' undeclared here (not in a function)
berylsettings.c:6404: error: '__pyx_getprop_13berylsettings_8Category_Plugins' undeclared here (not in a function)
berylsettings.c:6408: error: expected '=', ',', ';', 'asm' or '__attribute__' before '__pyx_tp_as_number_Category'
berylsettings.c:6449: error: expected '=', ',', ';', 'asm' or '__attribute__' before '__pyx_tp_as_sequence_Category'
berylsettings.c:6462: error: expected '=', ',', ';', 'asm' or '__attribute__' before '__pyx_tp_as_mapping_Category'
berylsettings.c:6468: error: expected '=', ',', ';', 'asm' or '__attribute__' before '__pyx_tp_as_buffer_Category'
berylsettings.c:6475: error: expected '=', ',', ';', 'asm' or '__attribute__' before '__pyx_type_13berylsettings_Category'
berylsettings.c:6524: error: expected '=', ',', ';', 'asm' or '__attribute__' before '*' token
berylsettings.c:6534: error: expected ')' before '*' token
berylsettings.c:6540: error: expected ')' before '*' token
berylsettings.c:6549: error: expected ')' before '*' token
berylsettings.c:6556: error: expected '=', ',', ';', 'asm' or '__attribute__' before '*' token
berylsettings.c:6560: error: expected ')' before '*' token
berylsettings.c:6570: error: expected '=', ',', ';', 'asm' or '__attribute__' before '*' token
berylsettings.c:6574: error: expected '=', ',', ';', 'asm' or '__attribute__' before '*' token
berylsettings.c:6578: error: expected '=', ',', ';', 'asm' or '__attribute__' before '*' token
berylsettings.c:6582: error: expected '=', ',', ';', 'asm' or '__attribute__' before '*' token
berylsettings.c:6586: error: expected '=', ',', ';', 'asm' or '__attribute__' before '*' token
berylsettings.c:6590: error: expected '=', ',', ';', 'asm' or '__attribute__' before '*' token
berylsettings.c:6594: error: expected '=', ',', ';', 'asm' or '__attribute__' before '*' token
berylsettings.c:6598: error: array type has incomplete element type
berylsettings.c:6599: error: expected '}' before '__pyx_f_13berylsettings_6Plugin_Group'
berylsettings.c:6600: error: expected '}' before '__pyx_f_13berylsettings_6Plugin_Setting'
berylsettings.c:6604: error: array type has incomplete element type
berylsettings.c:6605: error: '__pyx_getprop_13berylsettings_6Plugin_Enabled' undeclared here (not in a function)
berylsettings.c:6605: error: '__pyx_setprop_13berylsettings_6Plugin_Enabled' undeclared here (not in a function)
berylsettings.c:6606: error: '__pyx_getprop_13berylsettings_6Plugin_Name' undeclared here (not in a function)
berylsettings.c:6607: error: '__pyx_getprop_13berylsettings_6Plugin_ShortDesc' undeclared here (not in a function)
berylsettings.c:6608: error: '__pyx_getprop_13berylsettings_6Plugin_LongDesc' undeclared here (not in a function)
berylsettings.c:6609: error: '__pyx_getprop_13berylsettings_6Plugin_Settings' undeclared here (not in a function)
berylsettings.c:6610: error: '__pyx_getprop_13berylsettings_6Plugin_Groups' undeclared here (not in a function)
berylsettings.c:6611: error: '__pyx_getprop_13berylsettings_6Plugin_Provides' undeclared here (not in a function)
berylsettings.c:6612: error: '__pyx_getprop_13berylsettings_6Plugin_Requires' undeclared here (not in a function)
berylsettings.c:6616: error: expected '=', ',', ';', 'asm' or '__attribute__' before '__pyx_tp_as_number_Plugin'
berylsettings.c:6657: error: expected '=', ',', ';', 'asm' or '__attribute__' before '__pyx_tp_as_sequence_Plugin'
berylsettings.c:6670: error: expected '=', ',', ';', 'asm' or '__attribute__' before '__pyx_tp_as_mapping_Plugin'
berylsettings.c:6676: error: expected '=', ',', ';', 'asm' or '__attribute__' before '__pyx_tp_as_buffer_Plugin'
berylsettings.c:6683: error: expected '=', ',', ';', 'asm' or '__attribute__' before '__pyx_type_13berylsettings_Plugin'
berylsettings.c:6732: error: expected '=', ',', ';', 'asm' or '__attribute__' before '*' token
berylsettings.c:6742: error: expected ')' before '*' token
berylsettings.c:6748: error: expected ')' before '*' token
berylsettings.c:6757: error: expected ')' before '*' token
berylsettings.c:6764: error: expected '=', ',', ';', 'asm' or '__attribute__' before '*' token
berylsettings.c:6768: error: expected '=', ',', ';', 'asm' or '__attribute__' before '*' token
berylsettings.c:6772: error: expected '=', ',', ';', 'asm' or '__attribute__' before '*' token
berylsettings.c:6776: error: expected '=', ',', ';', 'asm' or '__attribute__' before '*' token
berylsettings.c:6780: error: array type has incomplete element type
berylsettings.c:6781: error: expected '}' before '__pyx_f_13berylsettings_5Group_SubGroup'
berylsettings.c:6785: error: array type has incomplete element type
berylsettings.c:6786: error: '__pyx_getprop_13berylsettings_5Group_Plugin' undeclared here (not in a function)
berylsettings.c:6787: error: '__pyx_getprop_13berylsettings_5Group_Name' undeclared here (not in a function)
berylsettings.c:6788: error: '__pyx_getprop_13berylsettings_5Group_Desc' undeclared here (not in a function)
berylsettings.c:6789: error: '__pyx_getprop_13berylsettings_5Group_SubGroups' undeclared here (not in a function)
berylsettings.c:6793: error: expected '=', ',', ';', 'asm' or '__attribute__' before '__pyx_tp_as_number_Group'
berylsettings.c:6834: error: expected '=', ',', ';', 'asm' or '__attribute__' before '__pyx_tp_as_sequence_Group'
berylsettings.c:6847: error: expected '=', ',', ';', 'asm' or '__attribute__' before '__pyx_tp_as_mapping_Group'
berylsettings.c:6853: error: expected '=', ',', ';', 'asm' or '__attribute__' before '__pyx_tp_as_buffer_Group'
berylsettings.c:6860: error: expected '=', ',', ';', 'asm' or '__attribute__' before '__pyx_type_13berylsettings_Group'
berylsettings.c:6909: error: expected '=', ',', ';', 'asm' or '__attribute__' before '*' token
berylsettings.c:6920: error: expected ')' before '*' token
berylsettings.c:6927: error: expected ')' before '*' token
berylsettings.c:6939: error: expected ')' before '*' token
berylsettings.c:6948: error: expected '=', ',', ';', 'asm' or '__attribute__' before '*' token
berylsettings.c:6952: error: expected '=', ',', ';', 'asm' or '__attribute__' before '*' token
berylsettings.c:6956: error: expected '=', ',', ';', 'asm' or '__attribute__' before '*' token
berylsettings.c:6960: error: array type has incomplete element type
berylsettings.c:6961: error: expected '}' before '__pyx_f_13berylsettings_8SubGroup_Setting'
berylsettings.c:6965: error: array type has incomplete element type
berylsettings.c:6966: error: '__pyx_getprop_13berylsettings_8SubGroup_Name' undeclared here (not in a function)
berylsettings.c:6967: error: '__pyx_getprop_13berylsettings_8SubGroup_Desc' undeclared here (not in a function)
berylsettings.c:6968: error: '__pyx_getprop_13berylsettings_8SubGroup_Settings' undeclared here (not in a function)
berylsettings.c:6972: error: expected '=', ',', ';', 'asm' or '__attribute__' before '__pyx_tp_as_number_SubGroup'
berylsettings.c:7013: error: expected '=', ',', ';', 'asm' or '__attribute__' before '__pyx_tp_as_sequence_SubGroup'
berylsettings.c:7026: error: expected '=', ',', ';', 'asm' or '__attribute__' before '__pyx_tp_as_mapping_SubGroup'
berylsettings.c:7032: error: expected '=', ',', ';', 'asm' or '__attribute__' before '__pyx_tp_as_buffer_SubGroup'
berylsettings.c:7039: error: expected '=', ',', ';', 'asm' or '__attribute__' before '__pyx_type_13berylsettings_SubGroup'
berylsettings.c:7088: error: expected '=', ',', ';', 'asm' or '__attribute__' before '*' token
berylsettings.c:7098: error: expected ')' before '*' token
berylsettings.c:7104: error: expected ')' before '*' token
berylsettings.c:7113: error: expected ')' before '*' token
berylsettings.c:7120: error: expected '=', ',', ';', 'asm' or '__attribute__' before '*' token
berylsettings.c:7124: error: expected '=', ',', ';', 'asm' or '__attribute__' before '*' token
berylsettings.c:7128: error: expected '=', ',', ';', 'asm' or '__attribute__' before '*' token
berylsettings.c:7132: error: expected '=', ',', ';', 'asm' or '__attribute__' before '*' token
berylsettings.c:7136: error: expected '=', ',', ';', 'asm' or '__attribute__' before '*' token
berylsettings.c:7140: error: expected '=', ',', ';', 'asm' or '__attribute__' before '*' token
berylsettings.c:7144: error: expected '=', ',', ';', 'asm' or '__attribute__' before '*' token
berylsettings.c:7148: error: expected '=', ',', ';', 'asm' or '__attribute__' before '*' token
berylsettings.c:7152: error: expected '=', ',', ';', 'asm' or '__attribute__' before '*' token
berylsettings.c:7156: error: expected '=', ',', ';', 'asm' or '__attribute__' before '*' token
berylsettings.c:7160: error: expected '=', ',', ';', 'asm' or '__attribute__' before '*' token
berylsettings.c:7164: error: expected '=', ',', ';', 'asm' or '__attribute__' before '*' token
berylsettings.c:7168: error: expected ')' before '*' token
berylsettings.c:7178: error: array type has incomplete element type
berylsettings.c:7179: error: expected '}' before '__pyx_f_13berylsettings_7Setting_ResetToDefault'
berylsettings.c:7180: error: expected '}' before '__pyx_f_13berylsettings_7Setting_HasHint'
berylsettings.c:7181: error: expected '}' before '__pyx_f_13berylsettings_7Setting_Conflicts'
berylsettings.c:7185: error: array type has incomplete element type
berylsettings.c:7186: error: '__pyx_getprop_13berylsettings_7Setting_Plugin' undeclared here (not in a function)
berylsettings.c:7187: error: '__pyx_getprop_13berylsettings_7Setting_Name' undeclared here (not in a function)
berylsettings.c:7188: error: '__pyx_getprop_13berylsettings_7Setting_ShortDesc' undeclared here (not in a function)
berylsettings.c:7189: error: '__pyx_getprop_13berylsettings_7Setting_LongDesc' undeclared here (not in a function)
berylsettings.c:7190: error: '__pyx_getprop_13berylsettings_7Setting_Group' undeclared here (not in a function)
berylsettings.c:7191: error: '__pyx_getprop_13berylsettings_7Setting_SubGroup' undeclared here (not in a function)
berylsettings.c:7192: error: '__pyx_getprop_13berylsettings_7Setting_Advanced' undeclared here (not in a function)
berylsettings.c:7193: error: '__pyx_getprop_13berylsettings_7Setting_Integrated' undeclared here (not in a function)
berylsettings.c:7194: error: '__pyx_getprop_13berylsettings_7Setting_ReadOnly' undeclared here (not in a function)
berylsettings.c:7195: error: '__pyx_getprop_13berylsettings_7Setting_Restrictions' undeclared here (not in a function)
berylsettings.c:7196: error: '__pyx_getprop_13berylsettings_7Setting_Type' undeclared here (not in a function)
berylsettings.c:7197: error: '__pyx_getprop_13berylsettings_7Setting_Value' undeclared here (not in a function)
berylsettings.c:7197: error: '__pyx_setprop_13berylsettings_7Setting_Value' undeclared here (not in a function)
berylsettings.c:7201: error: expected '=', ',', ';', 'asm' or '__attribute__' before '__pyx_tp_as_number_Setting'
berylsettings.c:7242: error: expected '=', ',', ';', 'asm' or '__attribute__' before '__pyx_tp_as_sequence_Setting'
berylsettings.c:7255: error: expected '=', ',', ';', 'asm' or '__attribute__' before '__pyx_tp_as_mapping_Setting'
berylsettings.c:7261: error: expected '=', ',', ';', 'asm' or '__attribute__' before '__pyx_tp_as_buffer_Setting'
berylsettings.c:7268: error: expected '=', ',', ';', 'asm' or '__attribute__' before '__pyx_type_13berylsettings_Setting'
berylsettings.c:7317: error: array type has incomplete element type
berylsettings.c:7318: error: expected '}' before '__pyx_f_13berylsettings_keytostring'
berylsettings.c:7319: error: expected '}' before '__pyx_f_13berylsettings_modstostring'
berylsettings.c:7320: error: expected '}' before '__pyx_f_13berylsettings_buttontostring'
berylsettings.c:7321: error: expected '}' before '__pyx_f_13berylsettings_edgelisttomask'
berylsettings.c:7322: error: expected '}' before '__pyx_f_13berylsettings_edgetolist'
berylsettings.c:7323: error: expected '}' before '__pyx_f_13berylsettings_send_reload'
berylsettings.c:7329: error: expected '=', ',', ';', 'asm' or '__attribute__' before 'initberylsettings'
berylsettings.c:7330: error: expected '=', ',', ';', 'asm' or '__attribute__' before 'initberylsettings'
berylsettings.c:7568: error: expected ')' before '*' token
berylsettings.c:7581: error: expected '=', ',', ';', 'asm' or '__attribute__' before '*' token
berylsettings.c:7589: error: expected '=', ',', ';', 'asm' or '__attribute__' before '*' token
berylsettings.c:7606: error: expected ')' before '*' token
berylsettings.c:7668: error: expected '=', ',', ';', 'asm' or '__attribute__' before '*' token
berylsettings.c: In function '__Pyx_InternStrings':
berylsettings.c:7699: error: '__Pyx_InternTabEntry' has no member named 'p'
berylsettings.c:7700: error: '__Pyx_InternTabEntry' has no member named 'p'
berylsettings.c:7700: warning: implicit declaration of function 'PyString_InternFromString'
berylsettings.c:7700: error: '__Pyx_InternTabEntry' has no member named 's'
berylsettings.c:7700: warning: assignment makes pointer from integer without a cast
berylsettings.c:7701: error: '__Pyx_InternTabEntry' has no member named 'p'
berylsettings.c: In function '__Pyx_InitStrings':
berylsettings.c:7709: error: '__Pyx_StringTabEntry' has no member named 'p'
berylsettings.c:7710: error: '__Pyx_StringTabEntry' has no member named 'p'
berylsettings.c:7710: warning: implicit declaration of function 'PyString_FromStringAndSize'
berylsettings.c:7710: error: '__Pyx_StringTabEntry' has no member named 's'
berylsettings.c:7710: error: '__Pyx_StringTabEntry' has no member named 'n'
berylsettings.c:7710: warning: assignment makes pointer from integer without a cast
berylsettings.c:7711: error: '__Pyx_StringTabEntry' has no member named 'p'
berylsettings.c:7718:21: error: compile.h: No such file or directory
berylsettings.c:7719:25: error: frameobject.h: No such file or directory
berylsettings.c:7720:23: error: traceback.h: No such file or directory
berylsettings.c: In function '__Pyx_AddTraceback':
berylsettings.c:7723: error: 'PyObject' undeclared (first use in this function)
berylsettings.c:7723: error: (Each undeclared identifier is reported only once
berylsettings.c:7723: error: for each function it appears in.)
berylsettings.c:7723: error: 'py_srcfile' undeclared (first use in this function)
berylsettings.c:7723: error: invalid operands to binary *
berylsettings.c:7723: warning: statement with no effect
berylsettings.c:7724: error: 'py_funcname' undeclared (first use in this function)
berylsettings.c:7724: error: invalid operands to binary *
berylsettings.c:7724: warning: statement with no effect
berylsettings.c:7725: error: 'py_globals' undeclared (first use in this function)
berylsettings.c:7725: error: invalid operands to binary *
berylsettings.c:7725: warning: statement with no effect
berylsettings.c:7726: error: 'empty_tuple' undeclared (first use in this function)
berylsettings.c:7726: error: invalid operands to binary *
berylsettings.c:7726: warning: statement with no effect
berylsettings.c:7727: error: 'empty_string' undeclared (first use in this function)
berylsettings.c:7727: error: invalid operands to binary *
berylsettings.c:7727: warning: statement with no effect
berylsettings.c:7728: error: 'PyCodeObject' undeclared (first use in this function)
berylsettings.c:7728: error: 'py_code' undeclared (first use in this function)
berylsettings.c:7728: error: invalid operands to binary *
berylsettings.c:7728: warning: statement with no effect
berylsettings.c:7729: error: 'PyFrameObject' undeclared (first use in this function)
berylsettings.c:7729: error: 'py_frame' undeclared (first use in this function)
berylsettings.c:7729: error: invalid operands to binary *
berylsettings.c:7729: warning: statement with no effect
berylsettings.c:7731: warning: implicit declaration of function 'PyString_FromString'
berylsettings.c:7731: warning: statement with no effect
berylsettings.c:7733: warning: statement with no effect
berylsettings.c:7735: warning: implicit declaration of function 'PyModule_GetDict'
berylsettings.c:7735: error: '__pyx_m' undeclared (first use in this function)
berylsettings.c:7735: warning: statement with no effect
berylsettings.c:7737: warning: implicit declaration of function 'PyTuple_New'
berylsettings.c:7737: warning: statement with no effect
berylsettings.c:7739: warning: statement with no effect
berylsettings.c:7741: warning: implicit declaration of function 'PyCode_New'
berylsettings.c:7756: warning: statement with no effect
berylsettings.c:7758: warning: implicit declaration of function 'PyFrame_New'
berylsettings.c:7759: warning: implicit declaration of function 'PyThreadState_Get'
berylsettings.c:7763: warning: statement with no effect
berylsettings.c:7765: error: request for member 'f_lineno' in something not a structure or union
berylsettings.c:7765: warning: statement with no effect
berylsettings.c:7766: warning: implicit declaration of function 'PyTraceBack_Here'
berylsettings.c:7768: warning: implicit declaration of function 'Py_XDECREF'
make[2]: *** [berylsettings.lo] Error 1
make[2]: se sale del directorio `/home/piinn8/trunk/beryl-settings-bindings/python'
make[1]: *** [all-recursive] Error 1
make[1]: se sale del directorio `/home/piinn8/trunk/beryl-settings-bindings'
make: *** [all] Error 2
BUILD FAILED for beryl-settings-bindings